{"text_format":"1","workbook":"xlsx","n_sheets":7,"sheets":["Questions","Input Evaluation of Conditions","Feasibility of Mitigation Msrs","_configuration","_scoring","_calculation","_changelog"],"not_rendered":{"charts":0,"images":0,"macros":1,"external_links":0,"defined_names":3,"comments":1,"pivot_tables":0},"unopened":[],"bounds":{"document_bytes":16777216,"sheet_cells":100000,"rows_first":2000,"rows_last":500,"rows_between":2000,"halvings":0,"cell_chars":16384,"cell_head_chars":4096},"cells_cut":0,"cells_raw":0,"read":"whole","date_system":"1900"}

{"sheet":"Questions","index":0,"n_rows":5,"n_cols":6,"rows_kept":5,"cut":false,"hidden":false,"merged":[]}
[null,"Question 1 of 16",null,"Votre réponse",null,"stored answer value"]
[1,{"$f":"VLOOKUP($A2,_configuration!$A$3:B34,2)","v":"Des pesticides de remplacement ou des options de lutte contre les ravageurs sont disponibles contre les ravageurs pour lesquels le pesticide devrait être homologué."},null,null,null,{"$f":"IF(ISBLANK(VLOOKUP($A2,'Input Evaluation of Conditions'!$A$2:$C$32,3)),\"\",VLOOKUP($A2,'Input Evaluation of Conditions'!$A$2:$C$32,3))","v":""}]
[]
[null,{"$f":"_configuration!B1","v":"Risques pour les pollinisateurs"}]
[null,"version : 27/06/2017"]

{"sheet":"Input Evaluation of Conditions","index":1,"n_rows":34,"n_cols":6,"rows_kept":34,"cut":false,"hidden":false,"merged":[]}
[null,{"$f":"_configuration!B1","v":"Risques pour les pollinisateurs"}]
[null,"Conditions préalables pour l’atténuation des risques",">> entrez ici <<",null,"Options"]
[1,{"$f":"IF(ISBLANK(_configuration!B3),\"\",_configuration!B3)&\" \"&IF(_configuration!C3=-1,\"*\",\"\")","v":"Des pesticides de remplacement ou des options de lutte contre les ravageurs sont disponibles contre les ravageurs pour lesquels le pesticide devrait être homologué. "},null,null,-1,"FAUX – la condition préalable n’est pas satisfaite dans le pays"]
[2,{"$f":"IF(ISBLANK(_configuration!B4),\"\",_configuration!B4)&\" \"&IF(_configuration!C4=-1,\"*\",\"\")","v":"La dose d’application du pesticide peut être réduite sans réduire l’efficacité du pesticide. "},null,null,0,"Non applicable"]
[3,{"$f":"IF(ISBLANK(_configuration!B5),\"\",_configuration!B5)&\" \"&IF(_configuration!C5=-1,\"*\",\"\")","v":"La fréquence de l’application peut être réduite, ou l’intervalle de traitement augmenté, sans réduire l’efficacité du pesticide. "},null,null,1,"PAS SÛR – la condition préalable est peut-être/parfois satisfaite dans le pays"]
[4,{"$f":"IF(ISBLANK(_configuration!B6),\"\",_configuration!B6)&\" \"&IF(_configuration!C6=-1,\"*\",\"\")","v":"Des types de préparation du même pesticide à moindre risque sont suffisamment efficaces contre le(s) ravageur(s) ciblé(s). "},null,null,2,"VRAI – la condition préalable est satisfaite dans le pays"]
{"$rows_left_out":29}
{"sheet":"Feasibility of Mitigation Msrs","index":2,"n_rows":28,"n_cols":4,"rows_kept":28,"cut":false,"hidden":false,"merged":[]}
[{"$f":"_configuration!B1","v":"Risques pour les pollinisateurs"}]
["Légende","result","#","Mesures d’atténuation des risques"]
["La mesure n'est pas faisable",{"$f":"_calculation!D$1","v":0},1,{"$f":"IF(_calculation!D$3=0,\"\",_calculation!D$3)","v":"N’homologuez pas le pesticide (ou supprimez progressivement un pesticide homologué) pour certaines ou toutes les utilisations"}]
["La mesure ne s'applique pas",{"$f":"_calculation!E$1","v":0},2,{"$f":"IF(_calculation!E$3=0,\"\",_calculation!E$3)","v":"Réduisez la dose d’application"}]
["La mesure pourrait être possible",{"$f":"_calculation!F$1","v":0},3,{"$f":"IF(_calculation!F$3=0,\"\",_calculation!F$3)","v":"Réduisez la fréquences des applications et/ou augmentez l’intervalle de traitement"}]
["La mesure est faisable",{"$f":"_calculation!G$1","v":0},4,{"$f":"IF(_calculation!G$3=0,\"\",_calculation!G$3)","v":"Limitez l’utilisation à des types de préparation qui entraînent une moindre exposition pour les abeilles (p.ex. préparations à libération lente, appâts, enrobages des semences, gra-nules)"}]
{"$rows_left_out":23}
{"sheet":"_configuration","index":3,"n_rows":33,"n_cols":29,"rows_kept":33,"cut":false,"hidden":false,"merged":[]}
["titre:","Risques pour les pollinisateurs","#",1,2,3,4,5,6,7,8,9,10,11,12,13,14,15,16,17,18,19,20,21,22,23,24,25]
["condition #","↓ Conditions (max 30) x Mesures de mitigation du risque (max 25) →",null,"N’homologuez pas le pesticide (ou supprimez progressivement un pesticide homologué) pour certaines ou toutes les utilisations","Réduisez la dose d’application","Réduisez la fréquences des applications et/ou augmentez l’intervalle de traitement","Limitez l’utilisation à des types de préparation qui entraînent une moindre exposition pour les abeilles (p.ex. préparations à libération lente, appâts, enrobages des semences, gra-nules)","Pour les semences traitées: requérez des enrobages des semences de haute qualité afin de réduire l’abrasion des semences et la dérive ultérieure de poussière pendant le forage.","Limitez l’utilisation à des applications à faibles ou nulles émissions (p.ex. serres, entrepôts, conteneurs)","Changez les périodes d’application (p.ex. ne l’appliquez pas pendant la floraison des cultures ou la floraison des mauvaises herbes dans les cultures)","Changez la période d’application (p.ex. ne l’appliquez que le soir, quand les abeilles ne sont pas actives, pour permettre au dépôt du pesticide de se dégrader)","Appliquez des techniques réduisant la dérive (p.ex. buses anti-dérive, déflecteurs de pulvé-risation)","N’autorisez pas l’épandage aérien","Pour les pesticides granulés et les semences traitées: exigez un équipement de forage de haute qualité afin de réduire l’abrasion des semences ou des granulés et la dérive ultérieure de poussière pendant le forage","Appliquez une bande tampon ( de végétation ) de non pulvérisation entre les champs traités et la zone hors champ afin de réduire la dérive","Exigez des conseils de prudence spécifiques sur l’étiquette ","Exigez une notification préalable aux apiculteurs pour leur permettre de déplacer ou de fermer les ruches",null,null,null,null,null,null,null,null,null,null,null,"End of data = 25 measures"]
[{"$f":"IF(ISBLANK(B3),\"\",1)","v":1},"Des pesticides de remplacement ou des options de lutte contre les ravageurs sont disponibles contre les ravageurs pour lesquels le pesticide devrait être homologué.",1,1]
[{"$f":"IF(ISBLANK(B4),\"\",A3+1)","v":2},"La dose d’application du pesticide peut être réduite sans réduire l’efficacité du pesticide.",1,null,2]
[{"$f":"IF(ISBLANK(B5),\"\",A4+1)","v":3},"La fréquence de l’application peut être réduite, ou l’intervalle de traitement augmenté, sans réduire l’efficacité du pesticide.",1,null,null,2]
[4,"Des types de préparation du même pesticide à moindre risque sont suffisamment efficaces contre le(s) ravageur(s) ciblé(s).",1,null,null,null,2]
{"$rows_left_out":28}
{"sheet":"_scoring","index":4,"n_rows":19,"n_cols":11,"rows_kept":19,"cut":false,"hidden":false,"merged":[]}
[null,"SCORING LOGIC BASED ON CONDITIONALITY AND WEIGHT"]
[null,null,null,"Irrelevant condition","Relevant condition","Essential condition"]
[null,null,"Conditionality",0,1,2,"< Weight"]
[null,"No answer",99,0,0,0]
[null,false,-1,0,-1,-1]
[null,"NA",0,0,0,-1]
{"$rows_left_out":14}
{"sheet":"_calculation","index":5,"n_rows":34,"n_cols":29,"rows_kept":34,"cut":false,"hidden":false,"merged":[]}
[null,null,"Overall feasibility score",{"$f":"MIN(IF(D4:D33<>0,D4:D33))","v":0},{"$f":"MIN(IF(E4:E33<>0,E4:E33))","v":0},{"$f":"MIN(IF(F4:F33<>0,F4:F33))","v":0},{"$f":"MIN(IF(G4:G33<>0,G4:G33))","v":0},{"$f":"MIN(IF(H4:H33<>0,H4:H33))","v":0},{"$f":"MIN(IF(I4:I33<>0,I4:I33))","v":0},{"$f":"MIN(IF(J4:J33<>0,J4:J33))","v":0},{"$f":"MIN(IF(K4:K33<>0,K4:K33))","v":0},{"$f":"MIN(IF(L4:L33<>0,L4:L33))","v":0},{"$f":"MIN(IF(M4:M33<>0,M4:M33))","v":0},{"$f":"MIN(IF(N4:N33<>0,N4:N33))","v":0},{"$f":"MIN(IF(O4:O33<>0,O4:O33))","v":0},{"$f":"MIN(IF(P4:P33<>0,P4:P33))","v":0},{"$f":"MIN(IF(Q4:Q33<>0,Q4:Q33))","v":0},{"$f":"MIN(IF(R4:R33<>0,R4:R33))","v":0},{"$f":"MIN(IF(S4:S33<>0,S4:S33))","v":0},{"$f":"MIN(IF(T4:T33<>0,T4:T33))","v":0},{"$f":"MIN(IF(U4:U33<>0,U4:U33))","v":0},{"$f":"MIN(IF(V4:V33<>0,V4:V33))","v":0},{"$f":"MIN(IF(W4:W33<>0,W4:W33))","v":0},{"$f":"MIN(IF(X4:X33<>0,X4:X33))","v":0},{"$f":"MIN(IF(Y4:Y33<>0,Y4:Y33))","v":0},{"$f":"MIN(IF(Z4:Z33<>0,Z4:Z33))","v":0},{"$f":"MIN(IF(AA4:AA33<>0,AA4:AA33))","v":0},{"$f":"MIN(IF(AB4:AB33<>0,AB4:AB33))","v":0}]
[null,null,"measure #",1,2,3,4,5,6,7,8,9,10,11,12,13,14,15,16,17,18,19,20,21,22,23,24,25]
["condition #",null,"feasibility score",{"$f":"_configuration!D2","v":"N’homologuez pas le pesticide (ou supprimez progressivement un pesticide homologué) pour certaines ou toutes les utilisations"},{"$f":"_configuration!E2","v":"Réduisez la dose d’application"},{"$f":"_configuration!F2","v":"Réduisez la fréquences des applications et/ou augmentez l’intervalle de traitement"},{"$f":"_configuration!G2","v":"Limitez l’utilisation à des types de préparation qui entraînent une moindre exposition pour les abeilles (p.ex. préparations à libération lente, appâts, enrobages des semences, gra-nules)"},{"$f":"_configuration!H2","v":"Pour les semences traitées: requérez des enrobages des semences de haute qualité afin de réduire l’abrasion des semences et la dérive ultérieure de poussière pendant le forage."},{"$f":"_configuration!I2","v":"Limitez l’utilisation à des applications à faibles ou nulles émissions (p.ex. serres, entrepôts, conteneurs)"},{"$f":"_configuration!J2","v":"Changez les périodes d’application (p.ex. ne l’appliquez pas pendant la floraison des cultures ou la floraison des mauvaises herbes dans les cultures)"},{"$f":"_configuration!K2","v":"Changez la période d’application (p.ex. ne l’appliquez que le soir, quand les abeilles ne sont pas actives, pour permettre au dépôt du pesticide de se dégrader)"},{"$f":"_configuration!L2","v":"Appliquez des techniques réduisant la dérive (p.ex. buses anti-dérive, déflecteurs de pulvé-risation)"},{"$f":"_configuration!M2","v":"N’autorisez pas l’épandage aérien"},{"$f":"_configuration!N2","v":"Pour les pesticides granulés et les semences traitées: exigez un équipement de forage de haute qualité afin de réduire l’abrasion des semences ou des granulés et la dérive ultérieure de poussière pendant le forage"},{"$f":"_configuration!O2","v":"Appliquez une bande tampon ( de végétation ) de non pulvérisation entre les champs traités et la zone hors champ afin de réduire la dérive"},{"$f":"_configuration!P2","v":"Exigez des conseils de prudence spécifiques sur l’étiquette "},{"$f":"_configuration!Q2","v":"Exigez une notification préalable aux apiculteurs pour leur permettre de déplacer ou de fermer les ruches"},{"$f":"_configuration!R2","v":0},{"$f":"_configuration!S2","v":0},{"$f":"_configuration!T2","v":0},{"$f":"_configuration!U2","v":0},{"$f":"_configuration!V2","v":0},{"$f":"_configuration!W2","v":0},{"$f":"_configuration!X2","v":0},{"$f":"_configuration!Y2","v":0},{"$f":"_configuration!Z2","v":0},{"$f":"_configuration!AA2","v":0},{"$f":"_configuration!AB2","v":0},{"$f":"_configuration!AC2","v":"End of data = 25 measures"}]
[1,{"$f":"_configuration!B3","v":"Des pesticides de remplacement ou des options de lutte contre les ravageurs sont disponibles contre les ravageurs pour lesquels le pesticide devrait être homologué."},{"$f":"IF(ISBLANK('Input Evaluation of Conditions'!C3),99,'Input Evaluation of Conditions'!C3*_configuration!C3)","v":99},{"$f":"INDEX(ScoreTable, MATCH($C4,ConditionalityList,0), MATCH(_configuration!D3,WeightList,0))","v":0},{"$f":"INDEX(ScoreTable, MATCH($C4,ConditionalityList,0), MATCH(_configuration!E3,WeightList,0))","v":0},{"$f":"INDEX(ScoreTable, MATCH($C4,ConditionalityList,0), MATCH(_configuration!F3,WeightList,0))","v":0},{"$f":"INDEX(ScoreTable, MATCH($C4,ConditionalityList,0), MATCH(_configuration!G3,WeightList,0))","v":0},{"$f":"INDEX(ScoreTable, MATCH($C4,ConditionalityList,0), MATCH(_configuration!H3,WeightList,0))","v":0},{"$f":"INDEX(ScoreTable, MATCH($C4,ConditionalityList,0), MATCH(_configuration!I3,WeightList,0))","v":0},{"$f":"INDEX(ScoreTable, MATCH($C4,ConditionalityList,0), MATCH(_configuration!J3,WeightList,0))","v":0},{"$f":"INDEX(ScoreTable, MATCH($C4,ConditionalityList,0), MATCH(_configuration!K3,WeightList,0))","v":0},{"$f":"INDEX(ScoreTable, MATCH($C4,ConditionalityList,0), MATCH(_configuration!L3,WeightList,0))","v":0},{"$f":"INDEX(ScoreTable, MATCH($C4,ConditionalityList,0), MATCH(_configuration!M3,WeightList,0))","v":0},{"$f":"INDEX(ScoreTable, MATCH($C4,ConditionalityList,0), MATCH(_configuration!N3,WeightList,0))","v":0},{"$f":"INDEX(ScoreTable, MATCH($C4,ConditionalityList,0), MATCH(_configuration!O3,WeightList,0))","v":0},{"$f":"INDEX(ScoreTable, MATCH($C4,ConditionalityList,0), MATCH(_configuration!P3,WeightList,0))","v":0},{"$f":"INDEX(ScoreTable, MATCH($C4,ConditionalityList,0), MATCH(_configuration!Q3,WeightList,0))","v":0},{"$f":"INDEX(ScoreTable, MATCH($C4,ConditionalityList,0), MATCH(_configuration!R3,WeightList,0))","v":0},{"$f":"INDEX(ScoreTable, MATCH($C4,ConditionalityList,0), MATCH(_configuration!S3,WeightList,0))","v":0},{"$f":"INDEX(ScoreTable, MATCH($C4,ConditionalityList,0), MATCH(_configuration!T3,WeightList,0))","v":0},{"$f":"INDEX(ScoreTable, MATCH($C4,ConditionalityList,0), MATCH(_configuration!U3,WeightList,0))","v":0},{"$f":"INDEX(ScoreTable, MATCH($C4,ConditionalityList,0), MATCH(_configuration!V3,WeightList,0))","v":0},{"$f":"INDEX(ScoreTable, MATCH($C4,ConditionalityList,0), MATCH(_configuration!W3,WeightList,0))","v":0},{"$f":"INDEX(ScoreTable, MATCH($C4,ConditionalityList,0), MATCH(_configuration!X3,WeightList,0))","v":0},{"$f":"INDEX(ScoreTable, MATCH($C4,ConditionalityList,0), MATCH(_configuration!Y3,WeightList,0))","v":0},{"$f":"INDEX(ScoreTable, MATCH($C4,ConditionalityList,0), MATCH(_configuration!Z3,WeightList,0))","v":0},{"$f":"INDEX(ScoreTable, MATCH($C4,ConditionalityList,0), MATCH(_configuration!AA3,WeightList,0))","v":0},{"$f":"INDEX(ScoreTable, MATCH($C4,ConditionalityList,0), MATCH(_configuration!AB3,WeightList,0))","v":0}]
[2,{"$f":"_configuration!B4","v":"La dose d’application du pesticide peut être réduite sans réduire l’efficacité du pesticide."},{"$f":"IF(ISBLANK('Input Evaluation of Conditions'!C4),99,'Input Evaluation of Conditions'!C4*_configuration!C4)","v":99},{"$f":"INDEX(ScoreTable, MATCH($C5,ConditionalityList,0), MATCH(_configuration!D4,WeightList,0))","v":0},{"$f":"INDEX(ScoreTable, MATCH($C5,ConditionalityList,0), MATCH(_configuration!E4,WeightList,0))","v":0},{"$f":"INDEX(ScoreTable, MATCH($C5,ConditionalityList,0), MATCH(_configuration!F4,WeightList,0))","v":0},{"$f":"INDEX(ScoreTable, MATCH($C5,ConditionalityList,0), MATCH(_configuration!G4,WeightList,0))","v":0},{"$f":"INDEX(ScoreTable, MATCH($C5,ConditionalityList,0), MATCH(_configuration!H4,WeightList,0))","v":0},{"$f":"INDEX(ScoreTable, MATCH($C5,ConditionalityList,0), MATCH(_configuration!I4,WeightList,0))","v":0},{"$f":"INDEX(ScoreTable, MATCH($C5,ConditionalityList,0), MATCH(_configuration!J4,WeightList,0))","v":0},{"$f":"INDEX(ScoreTable, MATCH($C5,ConditionalityList,0), MATCH(_configuration!K4,WeightList,0))","v":0},{"$f":"INDEX(ScoreTable, MATCH($C5,ConditionalityList,0), MATCH(_configuration!L4,WeightList,0))","v":0},{"$f":"INDEX(ScoreTable, MATCH($C5,ConditionalityList,0), MATCH(_configuration!M4,WeightList,0))","v":0},{"$f":"INDEX(ScoreTable, MATCH($C5,ConditionalityList,0), MATCH(_configuration!N4,WeightList,0))","v":0},{"$f":"INDEX(ScoreTable, MATCH($C5,ConditionalityList,0), MATCH(_configuration!O4,WeightList,0))","v":0},{"$f":"INDEX(ScoreTable, MATCH($C5,ConditionalityList,0), MATCH(_configuration!P4,WeightList,0))","v":0},{"$f":"INDEX(ScoreTable, MATCH($C5,ConditionalityList,0), MATCH(_configuration!Q4,WeightList,0))","v":0},{"$f":"INDEX(ScoreTable, MATCH($C5,ConditionalityList,0), MATCH(_configuration!R4,WeightList,0))","v":0},{"$f":"INDEX(ScoreTable, MATCH($C5,ConditionalityList,0), MATCH(_configuration!S4,WeightList,0))","v":0},{"$f":"INDEX(ScoreTable, MATCH($C5,ConditionalityList,0), MATCH(_configuration!T4,WeightList,0))","v":0},{"$f":"INDEX(ScoreTable, MATCH($C5,ConditionalityList,0), MATCH(_configuration!U4,WeightList,0))","v":0},{"$f":"INDEX(ScoreTable, MATCH($C5,ConditionalityList,0), MATCH(_configuration!V4,WeightList,0))","v":0},{"$f":"INDEX(ScoreTable, MATCH($C5,ConditionalityList,0), MATCH(_configuration!W4,WeightList,0))","v":0},{"$f":"INDEX(ScoreTable, MATCH($C5,ConditionalityList,0), MATCH(_configuration!X4,WeightList,0))","v":0},{"$f":"INDEX(ScoreTable, MATCH($C5,ConditionalityList,0), MATCH(_configuration!Y4,WeightList,0))","v":0},{"$f":"INDEX(ScoreTable, MATCH($C5,ConditionalityList,0), MATCH(_configuration!Z4,WeightList,0))","v":0},{"$f":"INDEX(ScoreTable, MATCH($C5,ConditionalityList,0), MATCH(_configuration!AA4,WeightList,0))","v":0},{"$f":"INDEX(ScoreTable, MATCH($C5,ConditionalityList,0), MATCH(_configuration!AB4,WeightList,0))","v":0}]
[3,{"$f":"_configuration!B5","v":"La fréquence de l’application peut être réduite, ou l’intervalle de traitement augmenté, sans réduire l’efficacité du pesticide."},{"$f":"IF(ISBLANK('Input Evaluation of Conditions'!C5),99,'Input Evaluation of Conditions'!C5*_configuration!C5)","v":99},{"$f":"INDEX(ScoreTable, MATCH($C6,ConditionalityList,0), MATCH(_configuration!D5,WeightList,0))","v":0},{"$f":"INDEX(ScoreTable, MATCH($C6,ConditionalityList,0), MATCH(_configuration!E5,WeightList,0))","v":0},{"$f":"INDEX(ScoreTable, MATCH($C6,ConditionalityList,0), MATCH(_configuration!F5,WeightList,0))","v":0},{"$f":"INDEX(ScoreTable, MATCH($C6,ConditionalityList,0), MATCH(_configuration!G5,WeightList,0))","v":0},{"$f":"INDEX(ScoreTable, MATCH($C6,ConditionalityList,0), MATCH(_configuration!H5,WeightList,0))","v":0},{"$f":"INDEX(ScoreTable, MATCH($C6,ConditionalityList,0), MATCH(_configuration!I5,WeightList,0))","v":0},{"$f":"INDEX(ScoreTable, MATCH($C6,ConditionalityList,0), MATCH(_configuration!J5,WeightList,0))","v":0},{"$f":"INDEX(ScoreTable, MATCH($C6,ConditionalityList,0), MATCH(_configuration!K5,WeightList,0))","v":0},{"$f":"INDEX(ScoreTable, MATCH($C6,ConditionalityList,0), MATCH(_configuration!L5,WeightList,0))","v":0},{"$f":"INDEX(ScoreTable, MATCH($C6,ConditionalityList,0), MATCH(_configuration!M5,WeightList,0))","v":0},{"$f":"INDEX(ScoreTable, MATCH($C6,ConditionalityList,0), MATCH(_configuration!N5,WeightList,0))","v":0},{"$f":"INDEX(ScoreTable, MATCH($C6,ConditionalityList,0), MATCH(_configuration!O5,WeightList,0))","v":0},{"$f":"INDEX(ScoreTable, MATCH($C6,ConditionalityList,0), MATCH(_configuration!P5,WeightList,0))","v":0},{"$f":"INDEX(ScoreTable, MATCH($C6,ConditionalityList,0), MATCH(_configuration!Q5,WeightList,0))","v":0},{"$f":"INDEX(ScoreTable, MATCH($C6,ConditionalityList,0), MATCH(_configuration!R5,WeightList,0))","v":0},{"$f":"INDEX(ScoreTable, MATCH($C6,ConditionalityList,0), MATCH(_configuration!S5,WeightList,0))","v":0},{"$f":"INDEX(ScoreTable, MATCH($C6,ConditionalityList,0), MATCH(_configuration!T5,WeightList,0))","v":0},{"$f":"INDEX(ScoreTable, MATCH($C6,ConditionalityList,0), MATCH(_configuration!U5,WeightList,0))","v":0},{"$f":"INDEX(ScoreTable, MATCH($C6,ConditionalityList,0), MATCH(_configuration!V5,WeightList,0))","v":0},{"$f":"INDEX(ScoreTable, MATCH($C6,ConditionalityList,0), MATCH(_configuration!W5,WeightList,0))","v":0},{"$f":"INDEX(ScoreTable, MATCH($C6,ConditionalityList,0), MATCH(_configuration!X5,WeightList,0))","v":0},{"$f":"INDEX(ScoreTable, MATCH($C6,ConditionalityList,0), MATCH(_configuration!Y5,WeightList,0))","v":0},{"$f":"INDEX(ScoreTable, MATCH($C6,ConditionalityList,0), MATCH(_configuration!Z5,WeightList,0))","v":0},{"$f":"INDEX(ScoreTable, MATCH($C6,ConditionalityList,0), MATCH(_configuration!AA5,WeightList,0))","v":0},{"$f":"INDEX(ScoreTable, MATCH($C6,ConditionalityList,0), MATCH(_configuration!AB5,WeightList,0))","v":0}]
{"$rows_left_out":29}
{"sheet":"_changelog","index":6,"n_rows":24,"n_cols":3,"rows_kept":24,"cut":false,"hidden":false,"merged":[]}
[]
[null,"Dimensions"]
[null,"This sheet is configured for 25 measures x 30 conditions"]
[null,"Each measure can depend on one or more conditions"]
[]
[null,"Conditions"]
{"$rows_left_out":18}